{"text_format":"1","workbook":"xlsx","n_sheets":4,"sheets":["Daily Programs","Indivigual Programs","Sheet4","Indivigual Program Log"],"not_rendered":{"charts":0,"images":0,"macros":1,"external_links":2,"defined_names":0,"comments":0,"pivot_tables":0},"unopened":[],"bounds":{"document_bytes":16777216,"sheet_cells":100000,"rows_first":2000,"rows_last":500,"rows_between":2000,"halvings":0,"cell_chars":16384,"cell_head_chars":4096},"cells_cut":0,"cells_raw":0,"read":"whole","date_system":"1900"}

{"sheet":"Daily Programs","index":0,"n_rows":10,"n_cols":3,"rows_kept":10,"cut":false,"hidden":false,"merged":[[0,0,0,2]]}
["Daily Programs"]
["Program","Air Times","Description"]
["News & Weather","8:00 AM, 12:00 PM, 4:00 PM, 8:00 PM","Local Weather Forcast and reading of current news"]
["PSA","12:00 AM, 5:00AM, 9:00 AM, 1:00 PM, 5:00 PM, 7:00 PM","Public Service Announcements produced by KMNR DJs that cover a variety of topics"]
["Ad Council","1:00 AM, 7:00 AM, 11:00 AM, 3:00 PM, 6:00 PM, 9:00 PM","Public Service Announcements produced by the Ad Council that cover a variety of topics"]
["Profile America","2:00 AM, 6:00 AM, 10:00 AM, 2:00 PM, 11:00 PM","Daily vignettes about events, commemerations, or observences for that day"]
["Ascertainment","3:00 AM, 7:00 AM, 11:00 AM, 3:00 PM, 9:00 PM","Programs produced by KMNR DJs about services and activities in the Rolla area"]
["Town and Campus","6:00 AM, 10:00 AM, 2:00 PM, 6:00 PM, 10:00 PM","Listener submited announcements of activites and events in the Rolla area"]
["Science and the Sea","8:00 AM, 12:00 PM, 4:00 PM, 8:00 PM","A presentation of marine science topics produced by the University of Texas Marine Sceince Institute"]
["Concert News","9:00 AM, 1:00 PM, 5:00 PM, 7:00 PM","Announcements of nearby concerts"]

{"sheet":"Indivigual Programs","index":1,"n_rows":421,"n_cols":3,"rows_kept":421,"cut":false,"hidden":false,"merged":[[0,0,0,2]]}
["Indivigual Program Descriptions"]
["Title","Type","Description"]
[{"$f":"[1]Sheet1!A2","v":"2 Sides 30"},{"$f":"[1]Sheet1!B2","v":"Ad Council"},{"$f":"[1]Sheet1!D2","v":0}]
[{"$f":"[1]Sheet1!A3","v":"2 Sides 60"},{"$f":"[1]Sheet1!B3","v":"Ad Council"},{"$f":"[1]Sheet1!D3","v":0}]
[{"$f":"[1]Sheet1!A4","v":"A seccond Chance 30"},{"$f":"[1]Sheet1!B4","v":"Ad Council"},{"$f":"[1]Sheet1!D4","v":0}]
[{"$f":"[1]Sheet1!A5","v":"Age Means Everything 30"},{"$f":"[1]Sheet1!B5","v":"Ad Council"},{"$f":"[1]Sheet1!D5","v":0}]
[{"$f":"[1]Sheet1!A6","v":"Age Means Everything 60"},{"$f":"[1]Sheet1!B6","v":"Ad Council"},{"$f":"[1]Sheet1!D6","v":0}]
[{"$f":"[1]Sheet1!A7","v":"Airtime 30"},{"$f":"[1]Sheet1!B7","v":"Ad Council"},{"$f":"[1]Sheet1!D7","v":0}]
[{"$f":"[1]Sheet1!A8","v":"Airtime 60"},{"$f":"[1]Sheet1!B8","v":"Ad Council"},{"$f":"[1]Sheet1!D8","v":0}]
[{"$f":"[1]Sheet1!A9","v":"Allison 30"},{"$f":"[1]Sheet1!B9","v":"Ad Council"},{"$f":"[1]Sheet1!D9","v":0}]
[{"$f":"[1]Sheet1!A10","v":"Attention Men 60"},{"$f":"[1]Sheet1!B10","v":"Ad Council"},{"$f":"[1]Sheet1!D10","v":0}]
[{"$f":"[1]Sheet1!A11","v":"Battlefield 30"},{"$f":"[1]Sheet1!B11","v":"Ad Council"},{"$f":"[1]Sheet1!D11","v":0}]
[{"$f":"[1]Sheet1!A12","v":"Battlefield 60"},{"$f":"[1]Sheet1!B12","v":"Ad Council"},{"$f":"[1]Sheet1!D12","v":0}]
[{"$f":"[1]Sheet1!A13","v":"Bear Hug Campfire 30"},{"$f":"[1]Sheet1!B13","v":"Ad Council"},{"$f":"[1]Sheet1!D13","v":0}]
[{"$f":"[1]Sheet1!A14","v":"Bear Hug Campfire 60"},{"$f":"[1]Sheet1!B14","v":"Ad Council"},{"$f":"[1]Sheet1!D14","v":0}]
[{"$f":"[1]Sheet1!A15","v":"Bento 30"},{"$f":"[1]Sheet1!B15","v":"Ad Council"},{"$f":"[1]Sheet1!D15","v":0}]
[{"$f":"[1]Sheet1!A16","v":"Best In Show Cat 30"},{"$f":"[1]Sheet1!B16","v":"Ad Council"},{"$f":"[1]Sheet1!D16","v":0}]
[{"$f":"[1]Sheet1!A17","v":"Best In Show Cat 60"},{"$f":"[1]Sheet1!B17","v":"Ad Council"},{"$f":"[1]Sheet1!D17","v":0}]
[{"$f":"[1]Sheet1!A18","v":"Best In Show Dog 30"},{"$f":"[1]Sheet1!B18","v":"Ad Council"},{"$f":"[1]Sheet1!D18","v":0}]
[{"$f":"[1]Sheet1!A19","v":"Best In Show Dog 60"},{"$f":"[1]Sheet1!B19","v":"Ad Council"},{"$f":"[1]Sheet1!D19","v":0}]
[{"$f":"[1]Sheet1!A20","v":"Best vs Standard 30"},{"$f":"[1]Sheet1!B20","v":"Ad Council"},{"$f":"[1]Sheet1!D20","v":0}]
[{"$f":"[1]Sheet1!A21","v":"Boss Baby 30"},{"$f":"[1]Sheet1!B21","v":"Ad Council"},{"$f":"[1]Sheet1!D21","v":0}]
[{"$f":"[1]Sheet1!A22","v":"Breakup 60"},{"$f":"[1]Sheet1!B22","v":"Ad Council"},{"$f":"[1]Sheet1!D22","v":0}]
[{"$f":"[1]Sheet1!A23","v":"CarAce 30"},{"$f":"[1]Sheet1!B23","v":"Ad Council"},{"$f":"[1]Sheet1!D23","v":0}]
[{"$f":"[1]Sheet1!A24","v":"Caregiver to Mom 30"},{"$f":"[1]Sheet1!B24","v":"Ad Council"},{"$f":"[1]Sheet1!D24","v":0}]
[{"$f":"[1]Sheet1!A25","v":"Caregiver to Mom 60"},{"$f":"[1]Sheet1!B25","v":"Ad Council"},{"$f":"[1]Sheet1!D25","v":0}]
[{"$f":"[1]Sheet1!A26","v":"Cellphone 30"},{"$f":"[1]Sheet1!B26","v":"Ad Council"},{"$f":"[1]Sheet1!D26","v":0}]
[{"$f":"[1]Sheet1!A27","v":"Chance 60"},{"$f":"[1]Sheet1!B27","v":"Ad Council"},{"$f":"[1]Sheet1!D27","v":0}]
[{"$f":"[1]Sheet1!A28","v":"Change of Plans 30"},{"$f":"[1]Sheet1!B28","v":"Ad Council"},{"$f":"[1]Sheet1!D28","v":0}]
[{"$f":"[1]Sheet1!A29","v":"Click 30"},{"$f":"[1]Sheet1!B29","v":"Ad Council"},{"$f":"[1]Sheet1!D29","v":0}]
[{"$f":"[1]Sheet1!A30","v":"Click 60"},{"$f":"[1]Sheet1!B30","v":"Ad Council"},{"$f":"[1]Sheet1!D30","v":0}]
[{"$f":"[1]Sheet1!A31","v":"Concert 30"},{"$f":"[1]Sheet1!B31","v":"Ad Council"},{"$f":"[1]Sheet1!D31","v":0}]
[{"$f":"[1]Sheet1!A32","v":"Concert 60"},{"$f":"[1]Sheet1!B32","v":"Ad Council"},{"$f":"[1]Sheet1!D32","v":0}]
[{"$f":"[1]Sheet1!A33","v":"DanicaPatrick 30"},{"$f":"[1]Sheet1!B33","v":"Ad Council"},{"$f":"[1]Sheet1!D33","v":0}]
[{"$f":"[1]Sheet1!A34","v":"DanicaPatrick 60"},{"$f":"[1]Sheet1!B34","v":"Ad Council"},{"$f":"[1]Sheet1!D34","v":0}]
[{"$f":"[1]Sheet1!A35","v":"Designer Jeans 30"},{"$f":"[1]Sheet1!B35","v":"Ad Council"},{"$f":"[1]Sheet1!D35","v":0}]
[{"$f":"[1]Sheet1!A36","v":"Designer Jeans 60"},{"$f":"[1]Sheet1!B36","v":"Ad Council"},{"$f":"[1]Sheet1!D36","v":0}]
[{"$f":"[1]Sheet1!A37","v":"Dont Wait-Earthquake 30"},{"$f":"[1]Sheet1!B37","v":"Ad Council"},{"$f":"[1]Sheet1!D37","v":0}]
[{"$f":"[1]Sheet1!A38","v":"Dont Wait-Tornado 30"},{"$f":"[1]Sheet1!B38","v":"Ad Council"},{"$f":"[1]Sheet1!D38","v":0}]
[{"$f":"[1]Sheet1!A39","v":"Dont Wait-Wildfire 30"},{"$f":"[1]Sheet1!B39","v":"Ad Council"},{"$f":"[1]Sheet1!D39","v":0}]
[{"$f":"[1]Sheet1!A40","v":"Dont Wait 30"},{"$f":"[1]Sheet1!B40","v":"Ad Council"},{"$f":"[1]Sheet1!D40","v":0}]
[{"$f":"[1]Sheet1!A41","v":"Dont Wait 60"},{"$f":"[1]Sheet1!B41","v":"Ad Council"},{"$f":"[1]Sheet1!D41","v":0}]
[{"$f":"[1]Sheet1!A42","v":"Dr Phil 30"},{"$f":"[1]Sheet1!B42","v":"Ad Council"},{"$f":"[1]Sheet1!D42","v":0}]
[{"$f":"[1]Sheet1!A43","v":"Dr Phil 60"},{"$f":"[1]Sheet1!B43","v":"Ad Council"},{"$f":"[1]Sheet1!D43","v":0}]
[{"$f":"[1]Sheet1!A44","v":"Driving Blind 30"},{"$f":"[1]Sheet1!B44","v":"Ad Council"},{"$f":"[1]Sheet1!D44","v":0}]
[{"$f":"[1]Sheet1!A45","v":"Driving Means 30"},{"$f":"[1]Sheet1!B45","v":"Ad Council"},{"$f":"[1]Sheet1!D45","v":0}]
[{"$f":"[1]Sheet1!A46","v":"Driving Sounds 30"},{"$f":"[1]Sheet1!B46","v":"Ad Council"},{"$f":"[1]Sheet1!D46","v":0}]
[{"$f":"[1]Sheet1!A47","v":"Expensive Night 60"},{"$f":"[1]Sheet1!B47","v":"Ad Council"},{"$f":"[1]Sheet1!D47","v":0}]
[{"$f":"[1]Sheet1!A48","v":"Feather 30"},{"$f":"[1]Sheet1!B48","v":"Ad Council"},{"$f":"[1]Sheet1!D48","v":0}]
[{"$f":"[1]Sheet1!A49","v":"Forest Animals 30"},{"$f":"[1]Sheet1!B49","v":"Ad Council"},{"$f":"[1]Sheet1!D49","v":0}]
[{"$f":"[1]Sheet1!A50","v":"Forest Animals 60"},{"$f":"[1]Sheet1!B50","v":"Ad Council"},{"$f":"[1]Sheet1!D50","v":0}]
[{"$f":"[1]Sheet1!A51","v":"Forest Benefits 30"},{"$f":"[1]Sheet1!B51","v":"Ad Council"},{"$f":"[1]Sheet1!D51","v":0}]
[{"$f":"[1]Sheet1!A52","v":"Forest Benefits 60"},{"$f":"[1]Sheet1!B52","v":"Ad Council"},{"$f":"[1]Sheet1!D52","v":0}]
[{"$f":"[1]Sheet1!A53","v":"Full Circle 30"},{"$f":"[1]Sheet1!B53","v":"Ad Council"},{"$f":"[1]Sheet1!D53","v":0}]
[{"$f":"[1]Sheet1!A54","v":"Full Circle 60"},{"$f":"[1]Sheet1!B54","v":"Ad Council"},{"$f":"[1]Sheet1!D54","v":0}]
[{"$f":"[1]Sheet1!A55","v":"Gift to Future Me 60"},{"$f":"[1]Sheet1!B55","v":"Ad Council"},{"$f":"[1]Sheet1!D55","v":0}]
[{"$f":"[1]Sheet1!A56","v":"GPS 30"},{"$f":"[1]Sheet1!B56","v":"Ad Council"},{"$f":"[1]Sheet1!D56","v":0}]
[{"$f":"[1]Sheet1!A57","v":"Groan 30"},{"$f":"[1]Sheet1!B57","v":"Ad Council"},{"$f":"[1]Sheet1!D57","v":0}]
[{"$f":"[1]Sheet1!A58","v":"Groan 60"},{"$f":"[1]Sheet1!B58","v":"Ad Council"},{"$f":"[1]Sheet1!D58","v":0}]
[{"$f":"[1]Sheet1!A59","v":"Grown Up 30"},{"$f":"[1]Sheet1!B59","v":"Ad Council"},{"$f":"[1]Sheet1!D59","v":0}]
[{"$f":"[1]Sheet1!A60","v":"Grown Up 60"},{"$f":"[1]Sheet1!B60","v":"Ad Council"},{"$f":"[1]Sheet1!D60","v":0}]
[{"$f":"[1]Sheet1!A61","v":"Guys Night Out-Moment 30"},{"$f":"[1]Sheet1!B61","v":"Ad Council"},{"$f":"[1]Sheet1!D61","v":0}]
[{"$f":"[1]Sheet1!A62","v":"Haircut 30"},{"$f":"[1]Sheet1!B62","v":"Ad Council"},{"$f":"[1]Sheet1!D62","v":0}]
[{"$f":"[1]Sheet1!A63","v":"Haircut 60"},{"$f":"[1]Sheet1!B63","v":"Ad Council"},{"$f":"[1]Sheet1!D63","v":0}]
[{"$f":"[1]Sheet1!A64","v":"Hamilton 30"},{"$f":"[1]Sheet1!B64","v":"Ad Council"},{"$f":"[1]Sheet1!D64","v":0}]
[{"$f":"[1]Sheet1!A65","v":"HouseAce 30"},{"$f":"[1]Sheet1!B65","v":"Ad Council"},{"$f":"[1]Sheet1!D65","v":0}]
[{"$f":"[1]Sheet1!A66","v":"How We Do It 60"},{"$f":"[1]Sheet1!B66","v":"Ad Council"},{"$f":"[1]Sheet1!D66","v":0}]
[{"$f":"[1]Sheet1!A67","v":"I know 30"},{"$f":"[1]Sheet1!B67","v":"Ad Council"},{"$f":"[1]Sheet1!D67","v":0}]
[{"$f":"[1]Sheet1!A68","v":"I want to be 30"},{"$f":"[1]Sheet1!B68","v":"Ad Council"},{"$f":"[1]Sheet1!D68","v":0}]
[{"$f":"[1]Sheet1!A69","v":"I want to be 60"},{"$f":"[1]Sheet1!B69","v":"Ad Council"},{"$f":"[1]Sheet1!D69","v":0}]
[{"$f":"[1]Sheet1!A70","v":"In Their Own Words 30"},{"$f":"[1]Sheet1!B70","v":"Ad Council"},{"$f":"[1]Sheet1!D70","v":0}]
[{"$f":"[1]Sheet1!A71","v":"In Their Own Words 60"},{"$f":"[1]Sheet1!B71","v":"Ad Council"},{"$f":"[1]Sheet1!D71","v":0}]
[{"$f":"[1]Sheet1!A72","v":"Indoor Baseball 30"},{"$f":"[1]Sheet1!B72","v":"Ad Council"},{"$f":"[1]Sheet1!D72","v":0}]
[{"$f":"[1]Sheet1!A73","v":"Inside the Mind 30"},{"$f":"[1]Sheet1!B73","v":"Ad Council"},{"$f":"[1]Sheet1!D73","v":0}]
[{"$f":"[1]Sheet1!A74","v":"Inside the Mind 60"},{"$f":"[1]Sheet1!B74","v":"Ad Council"},{"$f":"[1]Sheet1!D74","v":0}]
[{"$f":"[1]Sheet1!A75","v":"Josh Groban 30"},{"$f":"[1]Sheet1!B75","v":"Ad Council"},{"$f":"[1]Sheet1!D75","v":0}]
[{"$f":"[1]Sheet1!A76","v":"Josh Groban 60"},{"$f":"[1]Sheet1!B76","v":"Ad Council"},{"$f":"[1]Sheet1!D76","v":0}]
[{"$f":"[1]Sheet1!A77","v":"Julius Randle Reverse 60"},{"$f":"[1]Sheet1!B77","v":"Ad Council"},{"$f":"[1]Sheet1!D77","v":0}]
[{"$f":"[1]Sheet1!A78","v":"Leash 30"},{"$f":"[1]Sheet1!B78","v":"Ad Council"},{"$f":"[1]Sheet1!D78","v":0}]
[{"$f":"[1]Sheet1!A79","v":"Let Me Ask You 30"},{"$f":"[1]Sheet1!B79","v":"Ad Council"},{"$f":"[1]Sheet1!D79","v":0}]
[{"$f":"[1]Sheet1!A80","v":"Listen 30"},{"$f":"[1]Sheet1!B80","v":"Ad Council"},{"$f":"[1]Sheet1!D80","v":0}]
[{"$f":"[1]Sheet1!A81","v":"Listen 60"},{"$f":"[1]Sheet1!B81","v":"Ad Council"},{"$f":"[1]Sheet1!D81","v":0}]
[{"$f":"[1]Sheet1!A82","v":"Long Haul 30"},{"$f":"[1]Sheet1!B82","v":"Ad Council"},{"$f":"[1]Sheet1!D82","v":0}]
[{"$f":"[1]Sheet1!A83","v":"Look Down 30"},{"$f":"[1]Sheet1!B83","v":"Ad Council"},{"$f":"[1]Sheet1!D83","v":0}]
[{"$f":"[1]Sheet1!A84","v":"Lucky 60"},{"$f":"[1]Sheet1!B84","v":"Ad Council"},{"$f":"[1]Sheet1!D84","v":0}]
[{"$f":"[1]Sheet1!A85","v":"Lucky 30"},{"$f":"[1]Sheet1!B85","v":"Ad Council"},{"$f":"[1]Sheet1!D85","v":0}]
[{"$f":"[1]Sheet1!A86","v":"Missed Opportunity 60"},{"$f":"[1]Sheet1!B86","v":"Ad Council"},{"$f":"[1]Sheet1!D86","v":0}]
[{"$f":"[1]Sheet1!A87","v":"Moments 30"},{"$f":"[1]Sheet1!B87","v":"Ad Council"},{"$f":"[1]Sheet1!D87","v":0}]
[{"$f":"[1]Sheet1!A88","v":"Moments 60"},{"$f":"[1]Sheet1!B88","v":"Ad Council"},{"$f":"[1]Sheet1!D88","v":0}]
[{"$f":"[1]Sheet1!A89","v":"One More 30"},{"$f":"[1]Sheet1!B89","v":"Ad Council"},{"$f":"[1]Sheet1!D89","v":0}]
[{"$f":"[1]Sheet1!A90","v":"Online Dating 30"},{"$f":"[1]Sheet1!B90","v":"Ad Council"},{"$f":"[1]Sheet1!D90","v":0}]
[{"$f":"[1]Sheet1!A91","v":"Only in the forest 60"},{"$f":"[1]Sheet1!B91","v":"Ad Council"},{"$f":"[1]Sheet1!D91","v":0}]
[{"$f":"[1]Sheet1!A92","v":"Overconfidence 30"},{"$f":"[1]Sheet1!B92","v":"Ad Council"},{"$f":"[1]Sheet1!D92","v":0}]
[{"$f":"[1]Sheet1!A93","v":"Overconfidence 60"},{"$f":"[1]Sheet1!B93","v":"Ad Council"},{"$f":"[1]Sheet1!D93","v":0}]
[{"$f":"[1]Sheet1!A94","v":"Passengers 30"},{"$f":"[1]Sheet1!B94","v":"Ad Council"},{"$f":"[1]Sheet1!D94","v":0}]
[{"$f":"[1]Sheet1!A95","v":"Pavlov Purpose 30"},{"$f":"[1]Sheet1!B95","v":"Ad Council"},{"$f":"[1]Sheet1!D95","v":0}]
[{"$f":"[1]Sheet1!A96","v":"Pavlov Purpose 60"},{"$f":"[1]Sheet1!B96","v":"Ad Council"},{"$f":"[1]Sheet1!D96","v":0}]
[{"$f":"[1]Sheet1!A97","v":"Pets Anthem 30"},{"$f":"[1]Sheet1!B97","v":"Ad Council"},{"$f":"[1]Sheet1!D97","v":0}]
[{"$f":"[1]Sheet1!A98","v":"Pets Anthem 60"},{"$f":"[1]Sheet1!B98","v":"Ad Council"},{"$f":"[1]Sheet1!D98","v":0}]
[{"$f":"[1]Sheet1!A99","v":"Pool Party 30"},{"$f":"[1]Sheet1!B99","v":"Ad Council"},{"$f":"[1]Sheet1!D99","v":0}]
[{"$f":"[1]Sheet1!A100","v":"Power Suit 60"},{"$f":"[1]Sheet1!B100","v":"Ad Council"},{"$f":"[1]Sheet1!D100","v":0}]
[{"$f":"[1]Sheet1!A101","v":"Prediabetes Test 30"},{"$f":"[1]Sheet1!B101","v":"Ad Council"},{"$f":"[1]Sheet1!D101","v":0}]
[{"$f":"[1]Sheet1!A102","v":"Prediabetes Test 60"},{"$f":"[1]Sheet1!B102","v":"Ad Council"},{"$f":"[1]Sheet1!D102","v":0}]
[{"$f":"[1]Sheet1!A103","v":"Prom 60"},{"$f":"[1]Sheet1!B103","v":"Ad Council"},{"$f":"[1]Sheet1!D103","v":0}]
[{"$f":"[1]Sheet1!A104","v":"Rachael Ray 30"},{"$f":"[1]Sheet1!B104","v":"Ad Council"},{"$f":"[1]Sheet1!D104","v":0}]
[{"$f":"[1]Sheet1!A105","v":"Rachael Ray 60"},{"$f":"[1]Sheet1!B105","v":"Ad Council"},{"$f":"[1]Sheet1!D105","v":0}]
[{"$f":"[1]Sheet1!A106","v":"Reba McEntire 30"},{"$f":"[1]Sheet1!B106","v":"Ad Council"},{"$f":"[1]Sheet1!D106","v":0}]
[{"$f":"[1]Sheet1!A107","v":"Reba McEntire 60"},{"$f":"[1]Sheet1!B107","v":"Ad Council"},{"$f":"[1]Sheet1!D107","v":0}]
[{"$f":"[1]Sheet1!A108","v":"Redwoods 30"},{"$f":"[1]Sheet1!B108","v":"Ad Council"},{"$f":"[1]Sheet1!D108","v":0}]
[{"$f":"[1]Sheet1!A109","v":"Redwoods 60"},{"$f":"[1]Sheet1!B109","v":"Ad Council"},{"$f":"[1]Sheet1!D109","v":0}]
[{"$f":"[1]Sheet1!A110","v":"Rich 60"},{"$f":"[1]Sheet1!B110","v":"Ad Council"},{"$f":"[1]Sheet1!D110","v":0}]
[{"$f":"[1]Sheet1!A111","v":"Rich Uncle 60"},{"$f":"[1]Sheet1!B111","v":"Ad Council"},{"$f":"[1]Sheet1!D111","v":0}]
[{"$f":"[1]Sheet1!A112","v":"Rising Ashes-Chains 30"},{"$f":"[1]Sheet1!B112","v":"Ad Council"},{"$f":"[1]Sheet1!D112","v":0}]
[{"$f":"[1]Sheet1!A113","v":"Rising Ashes-Chains 60"},{"$f":"[1]Sheet1!B113","v":"Ad Council"},{"$f":"[1]Sheet1!D113","v":0}]
[{"$f":"[1]Sheet1!A114","v":"Rising Ashes-Fire Pit 30"},{"$f":"[1]Sheet1!B114","v":"Ad Council"},{"$f":"[1]Sheet1!D114","v":0}]
[{"$f":"[1]Sheet1!A115","v":"Rising Ashes-Fire Pit 60"},{"$f":"[1]Sheet1!B115","v":"Ad Council"},{"$f":"[1]Sheet1!D115","v":0}]
[{"$f":"[1]Sheet1!A116","v":"Rock Tshirt 30"},{"$f":"[1]Sheet1!B116","v":"Ad Council"},{"$f":"[1]Sheet1!D116","v":0}]
[{"$f":"[1]Sheet1!A117","v":"Rockstar 60"},{"$f":"[1]Sheet1!B117","v":"Ad Council"},{"$f":"[1]Sheet1!D117","v":0}]
[{"$f":"[1]Sheet1!A118","v":"Sense of Adventure 30"},{"$f":"[1]Sheet1!B118","v":"Ad Council"},{"$f":"[1]Sheet1!D118","v":0}]
[{"$f":"[1]Sheet1!A119","v":"Sense of Adventure 60"},{"$f":"[1]Sheet1!B119","v":"Ad Council"},{"$f":"[1]Sheet1!D119","v":0}]
{"$rows_left_out":302}
{"sheet":"Sheet4","index":2,"n_rows":10,"n_cols":11,"rows_kept":10,"cut":false,"hidden":true,"merged":[]}
["Air Time 60","21:04:00",{"$f":"B1","v":"21:04:00"},{"$f":"VLOOKUP(A1,[2]Sheet1!$A$2:$D$1000,3,TRUE)","v":"00:00:60"},{"$f":"B1+D1","v":"21:05:00"},{"$f":"E1","v":"21:05:00"},null,null,null,"00:00:00",":"]
["Karim 30","15:34:00",{"$f":"B2","v":"15:34:00"},{"$f":"VLOOKUP(A2,[2]Sheet1!$A$2:$D$1000,3,TRUE)","v":"00:00:60"},{"$f":"B2+D2","v":"15:35:00"},{"$f":"E2","v":"15:35:00"}]
["Tougher Than Tough 30","18:55:00",{"$f":"B3","v":"18:55:00"},{"$f":"VLOOKUP(A3,[2]Sheet1!$A$2:$D$1000,3,TRUE)","v":"00:01:00"},{"$f":"B3+D3","v":"18:56:00"},{"$f":"E3","v":"18:56:00"}]
["Rebekkah 30","01:33:00",{"$f":"B4","v":"01:33:00"},{"$f":"VLOOKUP(A4,[2]Sheet1!$A$2:$D$1000,3,TRUE)","v":"00:01:02"},{"$f":"B4+D4","v":"01:34:02"},{"$f":"E4","v":"01:34:02"}]
["Mailbox Decapitation","03:28:00",{"$f":"B5","v":"03:28:00"},{"$f":"VLOOKUP(A5,[2]Sheet1!$A$2:$D$1000,3,TRUE)","v":"00:00:30"},{"$f":"B5+D5","v":"03:28:30"},{"$f":"E5","v":"03:28:30"}]
["My Story Is Yours","13:55:00",{"$f":"B6","v":"13:55:00"},{"$f":"VLOOKUP(A6,[2]Sheet1!$A$2:$D$1000,3,TRUE)","v":"00:00:60"},{"$f":"B6+D6","v":"13:56:00"},{"$f":"E6","v":"13:56:00"}]
[null,null,{"$f":"B7","v":"00:00:00"},{"$f":"VLOOKUP(A7,[2]Sheet1!$A$2:$D$1000,3,TRUE)","v":{"$error":"#N/A"}},{"$f":"B7+D7","v":{"$error":"#N/A"}},{"$f":"E7","v":{"$error":"#N/A"}}]
[null,null,{"$f":"B8","v":"00:00:00"},{"$f":"VLOOKUP(A8,[2]Sheet1!$A$2:$D$1000,3,TRUE)","v":{"$error":"#N/A"}},{"$f":"B8+D8","v":{"$error":"#N/A"}},{"$f":"E8","v":{"$error":"#N/A"}}]
[null,null,{"$f":"B9","v":"00:00:00"},{"$f":"VLOOKUP(A9,[2]Sheet1!$A$2:$D$1000,3,TRUE)","v":{"$error":"#N/A"}},{"$f":"B9+D9","v":{"$error":"#N/A"}},{"$f":"E9","v":{"$error":"#N/A"}}]
[null,null,{"$f":"B10","v":"00:00:00"},{"$f":"VLOOKUP(A10,[2]Sheet1!$A$2:$D$1000,3,TRUE)","v":{"$error":"#N/A"}},{"$f":"B10+D10","v":{"$error":"#N/A"}},{"$f":"E10","v":{"$error":"#N/A"}}]

{"sheet":"Indivigual Program Log","index":3,"n_rows":273,"n_cols":3,"rows_kept":273,"cut":false,"hidden":false,"merged":[[0,0,0,2]]}
["Program Log"]
["Date","Program Type","Title (Start Time, End Time)"]
["1 Jan 2019","PSA",""]
["1 Jan 2019","Ascertainment",""]
["1 Jan 2019","Ad Council",""]
["2 Jan 2019","PSA",""]
["2 Jan 2019","Ascertainment",""]
["2 Jan 2019","Ad Council",""]
["3 Jan 2019","PSA",""]
["3 Jan 2019","Ascertainment",""]
["3 Jan 2019","Ad Council",""]
["4 Jan 2019","PSA",""]
["4 Jan 2019","Ascertainment",""]
["4 Jan 2019","Ad Council",""]
["5 Jan 2019","PSA",""]
["5 Jan 2019","Ascertainment",""]
["5 Jan 2019","Ad Council",""]
["6 Jan 2019","PSA",""]
["6 Jan 2019","Ascertainment",""]
["6 Jan 2019","Ad Council",""]
["7 Jan 2019","PSA",""]
["7 Jan 2019","Ascertainment",""]
["7 Jan 2019","Ad Council",""]
["8 Jan 2019","PSA",""]
["8 Jan 2019","Ascertainment",""]
["8 Jan 2019","Ad Council",""]
["9 Jan 2019","PSA",""]
["9 Jan 2019","Ascertainment",""]
["9 Jan 2019","Ad Council",""]
["10 Jan 2019","PSA",""]
["10 Jan 2019","Ascertainment",""]
["10 Jan 2019","Ad Council",""]
["11 Jan 2019","PSA",""]
["11 Jan 2019","Ascertainment",""]
["11 Jan 2019","Ad Council",""]
["12 Jan 2019","PSA",""]
["12 Jan 2019","Ascertainment",""]
["12 Jan 2019","Ad Council",""]
["13 Jan 2019","PSA",""]
["13 Jan 2019","Ascertainment",""]
["13 Jan 2019","Ad Council",""]
["14 Jan 2019","PSA",""]
["14 Jan 2019","Ascertainment",""]
["14 Jan 2019","Ad Council",""]
["15 Jan 2019","PSA",""]
["15 Jan 2019","Ascertainment",""]
["15 Jan 2019","Ad Council",""]
["16 Jan 2019","PSA",""]
["16 Jan 2019","Ascertainment",""]
["16 Jan 2019","Ad Council",""]
["17 Jan 2019","PSA",""]
["17 Jan 2019","Ascertainment",""]
["17 Jan 2019","Ad Council",""]
["18 Jan 2019","PSA",""]
["18 Jan 2019","Ascertainment",""]
["18 Jan 2019","Ad Council",""]
["19 Jan 2019","PSA",""]
["19 Jan 2019","Ascertainment",""]
["19 Jan 2019","Ad Council",""]
["20 Jan 2019","PSA",""]
["20 Jan 2019","Ascertainment",""]
["20 Jan 2019","Ad Council",""]
["21 Jan 2019","PSA",""]
["21 Jan 2019","Ascertainment",""]
["21 Jan 2019","Ad Council",""]
["22 Jan 2019","PSA",""]
["22 Jan 2019","Ascertainment",""]
["22 Jan 2019","Ad Council",""]
["23 Jan 2019","PSA",""]
["23 Jan 2019","Ascertainment",""]
["23 Jan 2019","Ad Council",""]
["24 Jan 2019","PSA",""]
["24 Jan 2019","Ascertainment",""]
["24 Jan 2019","Ad Council",""]
["25 Jan 2019","PSA",""]
["25 Jan 2019","Ascertainment",""]
["25 Jan 2019","Ad Council",""]
["26 Jan 2019","PSA",""]
["26 Jan 2019","Ascertainment",""]
["26 Jan 2019","Ad Council",""]
["27 Jan 2019","PSA",""]
["27 Jan 2019","Ascertainment",""]
["27 Jan 2019","Ad Council",""]
["28 Jan 2019","PSA",""]
["28 Jan 2019","Ascertainment",""]
["28 Jan 2019","Ad Council",""]
["29 Jan 2019","PSA",""]
["29 Jan 2019","Ascertainment",""]
["29 Jan 2019","Ad Council",""]
["30 Jan 2019","PSA",""]
["30 Jan 2019","Ascertainment",""]
["30 Jan 2019","Ad Council",""]
["31 Jan 2019","PSA",""]
["31 Jan 2019","Ascertainment",""]
["31 Jan 2019","Ad Council",""]
["1 Feb 2019","PSA",""]
["1 Feb 2019","Ascertainment",""]
["1 Feb 2019","Ad Council",""]
["2 Feb 2019","PSA",""]
["2 Feb 2019","Ascertainment",""]
["2 Feb 2019","Ad Council",""]
["3 Feb 2019","PSA",""]
["3 Feb 2019","Ascertainment",""]
["3 Feb 2019","Ad Council",""]
["4 Feb 2019","PSA",""]
["4 Feb 2019","Ascertainment",""]
["4 Feb 2019","Ad Council",""]
["5 Feb 2019","PSA",""]
["5 Feb 2019","Ascertainment",""]
["5 Feb 2019","Ad Council",""]
["6 Feb 2019","PSA",""]
["6 Feb 2019","Ascertainment",""]
["6 Feb 2019","Ad Council",""]
["7 Feb 2019","PSA",""]
["7 Feb 2019","Ascertainment",""]
["7 Feb 2019","Ad Council",""]
["8 Feb 2019","PSA",""]
["8 Feb 2019","Ascertainment",""]
["8 Feb 2019","Ad Council",""]
["9 Feb 2019","PSA",""]
{"$rows_left_out":153}