{"text_format":"1","workbook":"xlsx","n_sheets":4,"sheets":["Daily Programs","Indivigual Programs","Sheet4","Indivigual Program Log"],"not_rendered":{"charts":0,"images":0,"macros":1,"external_links":1,"defined_names":0,"comments":0,"pivot_tables":0},"unopened":[],"bounds":{"document_bytes":16777216,"sheet_cells":100000,"rows_first":2000,"rows_last":500,"rows_between":2000,"halvings":0,"cell_chars":16384,"cell_head_chars":4096},"cells_cut":0,"cells_raw":0,"read":"whole","date_system":"1900"}

{"sheet":"Daily Programs","index":0,"n_rows":10,"n_cols":3,"rows_kept":10,"cut":false,"hidden":false,"merged":[[0,0,0,2]]}
["Daily Programs"]
["Program","Air Times","Description"]
["News & Weather","8:00 AM, 12:00 PM, 4:00 PM, 8:00 PM","Local Weather Forcast and reading of current news"]
["PSA","12:00 AM, 5:00AM, 9:00 AM, 1:00 PM, 5:00 PM, 7:00 PM","Public Service Announcements produced by KMNR DJs that cover a variety of topics"]
["Ad Council","1:00 AM, 7:00 AM, 11:00 AM, 3:00 PM, 6:00 PM, 9:00 PM","Public Service Announcements produced by the Ad Council that cover a variety of topics"]
["Profile America","2:00 AM, 6:00 AM, 10:00 AM, 2:00 PM, 11:00 PM","Daily vignettes about events, commemerations, or observences for that day"]
["Ascertainment","3:00 AM, 7:00 AM, 11:00 AM, 3:00 PM, 9:00 PM","Programs produced by KMNR DJs about services and activities in the Rolla area"]
["Town and Campus","6:00 AM, 10:00 AM, 2:00 PM, 6:00 PM, 10:00 PM","Listener submited announcements of activites and events in the Rolla area"]
["Science and the Sea","8:00 AM, 12:00 PM, 4:00 PM, 8:00 PM","A presentation of marine science topics produced by the University of Texas Marine Sceince Institute"]
["Concert News","9:00 AM, 1:00 PM, 5:00 PM, 7:00 PM","Announcements of nearby concerts"]

{"sheet":"Indivigual Programs","index":1,"n_rows":421,"n_cols":3,"rows_kept":421,"cut":false,"hidden":false,"merged":[[0,0,0,2]]}
["Indivigual Program Descriptions"]
["Title","Type","Description"]
[{"$f":"[1]Sheet1!A2","v":"2 Sides 30"},{"$f":"[1]Sheet1!B2","v":"Ad Council"},{"$f":"[1]Sheet1!D2","v":0}]
[{"$f":"[1]Sheet1!A3","v":"2 Sides 60"},{"$f":"[1]Sheet1!B3","v":"Ad Council"},{"$f":"[1]Sheet1!D3","v":0}]
[{"$f":"[1]Sheet1!A4","v":"A seccond Chance 30"},{"$f":"[1]Sheet1!B4","v":"Ad Council"},{"$f":"[1]Sheet1!D4","v":0}]
[{"$f":"[1]Sheet1!A5","v":"Age Means Everything 30"},{"$f":"[1]Sheet1!B5","v":"Ad Council"},{"$f":"[1]Sheet1!D5","v":0}]
[{"$f":"[1]Sheet1!A6","v":"Age Means Everything 60"},{"$f":"[1]Sheet1!B6","v":"Ad Council"},{"$f":"[1]Sheet1!D6","v":0}]
[{"$f":"[1]Sheet1!A7","v":"Airtime 30"},{"$f":"[1]Sheet1!B7","v":"Ad Council"},{"$f":"[1]Sheet1!D7","v":0}]
[{"$f":"[1]Sheet1!A8","v":"Airtime 60"},{"$f":"[1]Sheet1!B8","v":"Ad Council"},{"$f":"[1]Sheet1!D8","v":0}]
[{"$f":"[1]Sheet1!A9","v":"Allison 30"},{"$f":"[1]Sheet1!B9","v":"Ad Council"},{"$f":"[1]Sheet1!D9","v":0}]
[{"$f":"[1]Sheet1!A10","v":"Attention Men 60"},{"$f":"[1]Sheet1!B10","v":"Ad Council"},{"$f":"[1]Sheet1!D10","v":0}]
[{"$f":"[1]Sheet1!A11","v":"Battlefield 30"},{"$f":"[1]Sheet1!B11","v":"Ad Council"},{"$f":"[1]Sheet1!D11","v":0}]
[{"$f":"[1]Sheet1!A12","v":"Battlefield 60"},{"$f":"[1]Sheet1!B12","v":"Ad Council"},{"$f":"[1]Sheet1!D12","v":0}]
[{"$f":"[1]Sheet1!A13","v":"Bear Hug Campfire 30"},{"$f":"[1]Sheet1!B13","v":"Ad Council"},{"$f":"[1]Sheet1!D13","v":0}]
[{"$f":"[1]Sheet1!A14","v":"Bear Hug Campfire 60"},{"$f":"[1]Sheet1!B14","v":"Ad Council"},{"$f":"[1]Sheet1!D14","v":0}]
[{"$f":"[1]Sheet1!A15","v":"Bento 30"},{"$f":"[1]Sheet1!B15","v":"Ad Council"},{"$f":"[1]Sheet1!D15","v":0}]
[{"$f":"[1]Sheet1!A16","v":"Best In Show Cat 30"},{"$f":"[1]Sheet1!B16","v":"Ad Council"},{"$f":"[1]Sheet1!D16","v":0}]
[{"$f":"[1]Sheet1!A17","v":"Best In Show Cat 60"},{"$f":"[1]Sheet1!B17","v":"Ad Council"},{"$f":"[1]Sheet1!D17","v":0}]
[{"$f":"[1]Sheet1!A18","v":"Best In Show Dog 30"},{"$f":"[1]Sheet1!B18","v":"Ad Council"},{"$f":"[1]Sheet1!D18","v":0}]
[{"$f":"[1]Sheet1!A19","v":"Best In Show Dog 60"},{"$f":"[1]Sheet1!B19","v":"Ad Council"},{"$f":"[1]Sheet1!D19","v":0}]
[{"$f":"[1]Sheet1!A20","v":"Best vs Standard 30"},{"$f":"[1]Sheet1!B20","v":"Ad Council"},{"$f":"[1]Sheet1!D20","v":0}]
[{"$f":"[1]Sheet1!A21","v":"Boss Baby 30"},{"$f":"[1]Sheet1!B21","v":"Ad Council"},{"$f":"[1]Sheet1!D21","v":0}]
[{"$f":"[1]Sheet1!A22","v":"Breakup 60"},{"$f":"[1]Sheet1!B22","v":"Ad Council"},{"$f":"[1]Sheet1!D22","v":0}]
[{"$f":"[1]Sheet1!A23","v":"CarAce 30"},{"$f":"[1]Sheet1!B23","v":"Ad Council"},{"$f":"[1]Sheet1!D23","v":0}]
[{"$f":"[1]Sheet1!A24","v":"Caregiver to Mom 30"},{"$f":"[1]Sheet1!B24","v":"Ad Council"},{"$f":"[1]Sheet1!D24","v":0}]
[{"$f":"[1]Sheet1!A25","v":"Caregiver to Mom 60"},{"$f":"[1]Sheet1!B25","v":"Ad Council"},{"$f":"[1]Sheet1!D25","v":0}]
[{"$f":"[1]Sheet1!A26","v":"Cellphone 30"},{"$f":"[1]Sheet1!B26","v":"Ad Council"},{"$f":"[1]Sheet1!D26","v":0}]
[{"$f":"[1]Sheet1!A27","v":"Chance 60"},{"$f":"[1]Sheet1!B27","v":"Ad Council"},{"$f":"[1]Sheet1!D27","v":0}]
[{"$f":"[1]Sheet1!A28","v":"Chang eof Plans 30"},{"$f":"[1]Sheet1!B28","v":"Ad Council"},{"$f":"[1]Sheet1!D28","v":0}]
[{"$f":"[1]Sheet1!A29","v":"Click 30"},{"$f":"[1]Sheet1!B29","v":"Ad Council"},{"$f":"[1]Sheet1!D29","v":0}]
[{"$f":"[1]Sheet1!A30","v":"Click 60"},{"$f":"[1]Sheet1!B30","v":"Ad Council"},{"$f":"[1]Sheet1!D30","v":0}]
[{"$f":"[1]Sheet1!A31","v":"Concert 30"},{"$f":"[1]Sheet1!B31","v":"Ad Council"},{"$f":"[1]Sheet1!D31","v":0}]
[{"$f":"[1]Sheet1!A32","v":"Concert 60"},{"$f":"[1]Sheet1!B32","v":"Ad Council"},{"$f":"[1]Sheet1!D32","v":0}]
[{"$f":"[1]Sheet1!A33","v":"DanicaPatrick 30"},{"$f":"[1]Sheet1!B33","v":"Ad Council"},{"$f":"[1]Sheet1!D33","v":0}]
[{"$f":"[1]Sheet1!A34","v":"DanicaPatrick 60"},{"$f":"[1]Sheet1!B34","v":"Ad Council"},{"$f":"[1]Sheet1!D34","v":0}]
[{"$f":"[1]Sheet1!A35","v":"Designer Jeans 30"},{"$f":"[1]Sheet1!B35","v":"Ad Council"},{"$f":"[1]Sheet1!D35","v":0}]
[{"$f":"[1]Sheet1!A36","v":"Designer Jeans 60"},{"$f":"[1]Sheet1!B36","v":"Ad Council"},{"$f":"[1]Sheet1!D36","v":0}]
[{"$f":"[1]Sheet1!A37","v":"Dont Wait-Earthquake 30"},{"$f":"[1]Sheet1!B37","v":"Ad Council"},{"$f":"[1]Sheet1!D37","v":0}]
[{"$f":"[1]Sheet1!A38","v":"Dont Wait-Tornado 30"},{"$f":"[1]Sheet1!B38","v":"Ad Council"},{"$f":"[1]Sheet1!D38","v":0}]
[{"$f":"[1]Sheet1!A39","v":"Dont Wait-Wildfire 30"},{"$f":"[1]Sheet1!B39","v":"Ad Council"},{"$f":"[1]Sheet1!D39","v":0}]
[{"$f":"[1]Sheet1!A40","v":"Dont Wait 30"},{"$f":"[1]Sheet1!B40","v":"Ad Council"},{"$f":"[1]Sheet1!D40","v":0}]
[{"$f":"[1]Sheet1!A41","v":"Dont Wait 60"},{"$f":"[1]Sheet1!B41","v":"Ad Council"},{"$f":"[1]Sheet1!D41","v":0}]
[{"$f":"[1]Sheet1!A42","v":"Dr Phil 30"},{"$f":"[1]Sheet1!B42","v":"Ad Council"},{"$f":"[1]Sheet1!D42","v":0}]
[{"$f":"[1]Sheet1!A43","v":"Dr Phil 60"},{"$f":"[1]Sheet1!B43","v":"Ad Council"},{"$f":"[1]Sheet1!D43","v":0}]
[{"$f":"[1]Sheet1!A44","v":"Driving Blind 30"},{"$f":"[1]Sheet1!B44","v":"Ad Council"},{"$f":"[1]Sheet1!D44","v":0}]
[{"$f":"[1]Sheet1!A45","v":"Driving Means 30"},{"$f":"[1]Sheet1!B45","v":"Ad Council"},{"$f":"[1]Sheet1!D45","v":0}]
[{"$f":"[1]Sheet1!A46","v":"Driving Sounds 30"},{"$f":"[1]Sheet1!B46","v":"Ad Council"},{"$f":"[1]Sheet1!D46","v":0}]
[{"$f":"[1]Sheet1!A47","v":"Expensive Night 60"},{"$f":"[1]Sheet1!B47","v":"Ad Council"},{"$f":"[1]Sheet1!D47","v":0}]
[{"$f":"[1]Sheet1!A48","v":"Feather 30"},{"$f":"[1]Sheet1!B48","v":"Ad Council"},{"$f":"[1]Sheet1!D48","v":0}]
[{"$f":"[1]Sheet1!A49","v":"Forest Animals 30"},{"$f":"[1]Sheet1!B49","v":"Ad Council"},{"$f":"[1]Sheet1!D49","v":0}]
[{"$f":"[1]Sheet1!A50","v":"Forest Animals 60"},{"$f":"[1]Sheet1!B50","v":"Ad Council"},{"$f":"[1]Sheet1!D50","v":0}]
[{"$f":"[1]Sheet1!A51","v":"Forest Benefits 30"},{"$f":"[1]Sheet1!B51","v":"Ad Council"},{"$f":"[1]Sheet1!D51","v":0}]
[{"$f":"[1]Sheet1!A52","v":"Forest Benefits 60"},{"$f":"[1]Sheet1!B52","v":"Ad Council"},{"$f":"[1]Sheet1!D52","v":0}]
[{"$f":"[1]Sheet1!A53","v":"Full Circle 30"},{"$f":"[1]Sheet1!B53","v":"Ad Council"},{"$f":"[1]Sheet1!D53","v":0}]
[{"$f":"[1]Sheet1!A54","v":"Full Circle 60"},{"$f":"[1]Sheet1!B54","v":"Ad Council"},{"$f":"[1]Sheet1!D54","v":0}]
[{"$f":"[1]Sheet1!A55","v":"Gift to Future Me 60"},{"$f":"[1]Sheet1!B55","v":"Ad Council"},{"$f":"[1]Sheet1!D55","v":0}]
[{"$f":"[1]Sheet1!A56","v":"GPS 30"},{"$f":"[1]Sheet1!B56","v":"Ad Council"},{"$f":"[1]Sheet1!D56","v":0}]
[{"$f":"[1]Sheet1!A57","v":"Groan 30"},{"$f":"[1]Sheet1!B57","v":"Ad Council"},{"$f":"[1]Sheet1!D57","v":0}]
[{"$f":"[1]Sheet1!A58","v":"Groan 60"},{"$f":"[1]Sheet1!B58","v":"Ad Council"},{"$f":"[1]Sheet1!D58","v":0}]
[{"$f":"[1]Sheet1!A59","v":"Grown Up 30"},{"$f":"[1]Sheet1!B59","v":"Ad Council"},{"$f":"[1]Sheet1!D59","v":0}]
{"$rows_left_out":362}
{"sheet":"Sheet4","index":2,"n_rows":10,"n_cols":11,"rows_kept":10,"cut":false,"hidden":true,"merged":[]}
["Listen 30","01:31:00",{"$f":"B1","v":"01:31:00"},{"$f":"VLOOKUP(A1,[1]Sheet1!$A$2:$D$1000,3,FALSE)","v":30},{"$f":"TRUNC(D1/60,0)","v":0},{"$f":"MOD(D1,60)","v":30},{"$f":"CONCATENATE(J1, E1, K1, F1)","v":"00:00:30"},{"$f":"B1+G1","v":"01:31:30"},{"$f":"H1","v":"01:31:30"},"00:0",":"]
["Josh Groban 30","21:41:00",{"$f":"B2","v":"21:41:00"},{"$f":"VLOOKUP(A2,[1]Sheet1!$A$2:$D$1000,3,FALSE)","v":30},{"$f":"TRUNC(D2/60,0)","v":0},{"$f":"MOD(D2,60)","v":30},{"$f":"CONCATENATE(J1, E2, K1, F2)","v":"00:00:30"},{"$f":"B2+G2","v":"21:41:30"},{"$f":"H2","v":"21:41:30"}]
["Moments 60","15:30:00",{"$f":"B3","v":"15:30:00"},{"$f":"VLOOKUP(A3,[1]Sheet1!$A$2:$D$1000,3,FALSE)","v":60},{"$f":"TRUNC(D3/60,0)","v":1},{"$f":"MOD(D3,60)","v":0},{"$f":"CONCATENATE(J1, E3, K1, F3)","v":"00:01:0"},{"$f":"B3+G3","v":"15:31:00"},{"$f":"H3","v":"15:31:00"}]
["Chance 60","01:32:00",{"$f":"B4","v":"01:32:00"},{"$f":"VLOOKUP(A4,[1]Sheet1!$A$2:$D$1000,3,FALSE)","v":60},{"$f":"TRUNC(D4/60,0)","v":1},{"$f":"MOD(D4,60)","v":0},{"$f":"CONCATENATE(J1, E4, K1, F4)","v":"00:01:0"},{"$f":"B4+G4","v":"01:33:00"},{"$f":"H4","v":"01:33:00"}]
["Surprise You 30","18:46:00",{"$f":"B5","v":"18:46:00"},{"$f":"VLOOKUP(A5,[1]Sheet1!$A$2:$D$1000,3,FALSE)","v":30},{"$f":"TRUNC(D5/60,0)","v":0},{"$f":"MOD(D5,60)","v":30},{"$f":"CONCATENATE(J1, E5, K1, F5)","v":"00:00:30"},{"$f":"B5+G5","v":"18:46:30"},{"$f":"H5","v":"18:46:30"}]
["Designer Jeans 60","18:29:00",{"$f":"B6","v":"18:29:00"},{"$f":"VLOOKUP(A6,[1]Sheet1!$A$2:$D$1000,3,FALSE)","v":60},{"$f":"TRUNC(D6/60,0)","v":1},{"$f":"MOD(D6,60)","v":0},{"$f":"CONCATENATE(J1, E6, K1, F6)","v":"00:01:0"},{"$f":"B6+G6","v":"18:30:00"},{"$f":"H6","v":"18:30:00"}]
[null,null,{"$f":"B7","v":"00:00:00"},{"$f":"VLOOKUP(A7,[1]Sheet1!$A$2:$D$1000,3,FALSE)","v":{"$error":"#N/A"}},{"$f":"TRUNC(D7/60,0)","v":{"$error":"#N/A"}},{"$f":"MOD(D7,60)","v":{"$error":"#N/A"}},{"$f":"CONCATENATE(J1, E7, K1, F7)","v":{"$error":"#N/A"}},{"$f":"B7+G7","v":{"$error":"#N/A"}},{"$f":"H7","v":{"$error":"#N/A"}}]
[null,null,{"$f":"B8","v":"00:00:00"},{"$f":"VLOOKUP(A8,[1]Sheet1!$A$2:$D$1000,3,FALSE)","v":{"$error":"#N/A"}},{"$f":"TRUNC(D8/60,0)","v":{"$error":"#N/A"}},{"$f":"MOD(D8,60)","v":{"$error":"#N/A"}},{"$f":"CONCATENATE(J1, E8, K1, F8)","v":{"$error":"#N/A"}},{"$f":"B8+G8","v":{"$error":"#N/A"}},{"$f":"H8","v":{"$error":"#N/A"}}]
[null,null,{"$f":"B9","v":"00:00:00"},{"$f":"VLOOKUP(A9,[1]Sheet1!$A$2:$D$1000,3,FALSE)","v":{"$error":"#N/A"}},{"$f":"TRUNC(D9/60,0)","v":{"$error":"#N/A"}},{"$f":"MOD(D9,60)","v":{"$error":"#N/A"}},{"$f":"CONCATENATE(J1, E9, K1, F9)","v":{"$error":"#N/A"}},{"$f":"B9+G9","v":{"$error":"#N/A"}},{"$f":"H9","v":{"$error":"#N/A"}}]
[null,null,{"$f":"B10","v":"00:00:00"},{"$f":"VLOOKUP(A10,[1]Sheet1!$A$2:$D$1000,3,FALSE)","v":{"$error":"#N/A"}},{"$f":"TRUNC(D10/60,0)","v":{"$error":"#N/A"}},{"$f":"MOD(D10,60)","v":{"$error":"#N/A"}},{"$f":"CONCATENATE(J1, E10, K1, F10)","v":{"$error":"#N/A"}},{"$f":"B10+G10","v":{"$error":"#N/A"}},{"$f":"H10","v":{"$error":"#N/A"}}]

{"sheet":"Indivigual Program Log","index":3,"n_rows":276,"n_cols":3,"rows_kept":276,"cut":false,"hidden":false,"merged":[[0,0,0,2]]}
["Program Log"]
["Date","Program Type","Title (Start Time, End Time)"]
["1 Apr 2018","PSA","Donate Your Eyes (5:51:00 PM, 5:52:35 PM), Graffiti (12:52:00 AM, 12:52:59 AM), "]
["1 Apr 2018","Ascertainment","Student Success Center (11:47:00 AM, 11:48:04 AM), "]
["1 Apr 2018","Ad Council","Haircut 60 (2:00:00 AM, 2:01:00 AM), Groan 60 (11:48:00 AM, 11:49:00 AM), "]
["2 Apr 2018","PSA","Peanutbutter And Jelly (7:22:00 PM, 7:23:25 PM), Piercing Safety (5:21:00 PM, 5:22:37 PM), Ocelots (1:23:00 PM, 1:23:59 PM), Homophones (12:54:00 AM, 12:55:04 AM), Brush Your Teeth (9:41:00 AM, 9:41:54 AM), "]
["2 Apr 2018","Ascertainment","Video Game Addiction (3:43:00 PM, 3:45:25 PM), Marijuana (9:44:00 PM, 9:46:30 PM), Nature Conservation (11:22:00 AM, 11:25:29 AM), "]
["2 Apr 2018","Ad Council","Tune Out 30 (9:44:00 PM, 9:44:30 PM), Haircut 60 (11:37:00 AM, 11:38:00 AM), Groan 60 (3:14:00 PM, 3:15:00 PM), DonT Wait-Wildfire 30 (1:39:00 AM, 1:39:30 AM), PreDiabetes Test 30 (6:51:00 PM, 6:51:30 PM), "]
["3 Apr 2018","PSA","Aliens (1:37:00 PM, 1:38:22 PM), Road Rage Ii (7:39:00 PM, 7:42:49 PM), Homophones (5:05:00 PM, 5:06:04 PM), Brush Your Teeth (12:45:00 AM, 12:45:54 AM), "]
["3 Apr 2018","Ascertainment","SkatePark (4:06:00 PM, 4:06:46 PM), Dont be a Stalker (9:48:00 PM, 9:49:35 PM), Climbing Club (11:22:00 AM, 11:23:24 AM), Turn Down Your Ding Dang Speakers (7:42:00 AM, 7:44:15 AM), "]
["3 Apr 2018","Ad Council","Dont Wait-Earthquake 30 (9:47:00 PM, 9:47:30 PM), Grown Up 30 (11:34:00 AM, 11:34:30 AM), 2 Sides 30 (1:40:00 AM, 1:40:30 AM), Listen 30 (7:43:00 AM, 7:43:30 AM), Forest Animals 60 (3:36:00 PM, 3:37:00 PM), Designer Jeans 30 (6:04:00 PM, 6:04:30 PM), "]
["4 Apr 2018","PSA","Vaccines (8:25:00 PM, 8:28:24 PM), Absentee Voting (12:45:00 AM, 12:45:43 AM), Flat Earth (5:13:00 PM, 5:14:20 PM), "]
["4 Apr 2018","Ascertainment","Recycling (3:59:00 PM, 4:02:15 PM), Stressless Room (11:39:00 AM, 11:40:14 AM), Mailbox Decapitation (9:20:00 PM, 9:20:45 PM), Turn Down Your Ding Dang Speakers (3:39:00 AM, 3:41:15 AM), "]
["4 Apr 2018","Ad Council","Smiles 30 (1:46:00 AM, 1:46:30 AM), Grown Up 30 (11:24:00 AM, 11:24:30 AM), Forest Animals 60 (7:02:00 PM, 7:03:00 PM), Concert 30 (9:20:00 PM, 9:20:30 PM), Concert 60 (2:59:00 PM, 3:00:00 PM), "]
["5 Apr 2018","PSA","Single-Serve Coffee (1:16:00 PM, 1:17:02 PM), Beezin (9:16:00 AM, 9:16:58 AM), Sink Hole (12:34:00 AM, 12:35:41 AM), "]
["5 Apr 2018","Ascertainment","Bowling (11:23:00 AM, 11:24:07 AM), Rolla Rural Fire (9:49:00 PM, 9:51:12 PM), MSTRecCenter (3:00:00 PM, 3:00:34 PM), "]
["5 Apr 2018","Ad Council","Click 30 (9:48:00 PM, 9:48:30 PM), Designer Jeans 30 (3:00:00 PM, 3:00:30 PM), Best In Show Dog 60 (6:47:00 PM, 6:48:00 PM), Bento 30 (11:40:00 AM, 11:40:30 AM), Online Dating 30 (1:24:00 AM, 1:24:30 AM), "]
["6 Apr 2018","PSA","Single-Serve Coffee (1:18:00 PM, 1:19:02 PM), Data Due Diligence (7:37:00 PM, 7:38:51 PM), Sleep (12:47:00 AM, 12:48:04 AM), Drink Milk (5:44:00 PM, 5:44:55 PM), "]
["6 Apr 2018","Ascertainment","Mst Music (9:22:00 PM, 9:23:23 PM), Dags (3:25:00 AM, 3:25:45 AM), Lead (3:50:00 PM, 3:50:52 PM), Sports Programs (11:10:00 AM, 11:11:09 AM), Stressless Room (7:17:00 AM, 7:18:14 AM), "]
["6 Apr 2018","Ad Council","Hamilton 30 (1:47:00 AM, 1:47:30 AM), 2 Sides 60 (3:34:00 PM, 3:35:00 PM), Groan 30 (9:52:00 PM, 9:52:30 PM), Breakup 60 (7:39:00 AM, 7:40:00 AM), Leash 30 (6:53:00 PM, 6:53:30 PM), Surprise You 30 (11:43:00 AM, 11:43:30 AM), "]
["7 Apr 2018","PSA","Pets In Cars (1:05:00 PM, 1:05:34 PM), Call Your Mom (5:27:00 PM, 5:27:40 PM), Caffeine Addiction And You (7:18:00 PM, 7:18:56 PM), Bee Swarm (9:04:00 AM, 9:04:43 AM), Shoplifting (12:27:00 AM, 12:28:30 AM), "]
["7 Apr 2018","Ascertainment","University Police (9:36:00 PM, 9:37:09 PM), Go Outside (3:34:00 AM, 3:35:53 AM), MSTRecCenter (11:22:00 AM, 11:22:34 AM), "]
["7 Apr 2018","Ad Council","2 Sides 60 (11:22:00 AM, 11:23:00 AM), Taxi 60 (9:36:00 PM, 9:37:00 PM), Click 60 (6:40:00 PM, 6:41:00 PM), Breakup 60 (2:06:00 AM, 2:07:00 AM), "]
["8 Apr 2018","PSA","Beezin (12:41:00 AM, 12:41:58 AM), My Story Is Yours (7:25:00 PM, 7:25:21 PM), DonT Steal Wireless (5:45:00 PM, 5:46:06 PM), In The Trash (1:25:00 PM, 1:26:25 PM), "]
["8 Apr 2018","Ascertainment","Vote With Elton John (3:37:00 PM, 3:38:38 PM), Go Outside (7:24:00 AM, 7:25:53 AM), Frisbeegolf (11:45:00 AM, 11:45:37 AM), "]
["8 Apr 2018","Ad Council","Bear Hug Campfire 30 (7:09:00 PM, 7:09:30 PM), Rich Uncle 60 (3:17:00 PM, 3:18:00 PM), Forest Animals 60 (7:26:00 AM, 7:27:00 AM), Bear Hug Campfire 60 (11:44:00 AM, 11:45:00 AM), Leash 30 (1:47:00 AM, 1:47:30 AM), "]
["9 Apr 2018","PSA","DonT Die From The Cold (7:30:00 PM, 7:31:17 PM), Ibs (5:22:00 PM, 5:22:53 PM), Cellphones At Concerts (9:43:00 AM, 9:44:30 AM), Go To Class (12:35:00 AM, 12:36:13 AM), "]
["9 Apr 2018","Ascertainment","Curbside Recycling I (9:34:00 PM, 9:36:37 PM), University Police (7:29:00 AM, 7:30:09 AM), Frisbeegolf (3:29:00 PM, 3:29:37 PM), Marijuana (3:33:00 AM, 3:35:30 AM), Turn Down Your Ding Dang Speakers (11:18:00 AM, 11:20:15 AM), "]
["9 Apr 2018","Ad Council","Wed Do Anything 60 (11:47:00 AM, 11:48:00 AM), Best In Show Dog 60 (1:32:00 AM, 1:33:00 AM), Rising Ashes-Chains 30 (6:38:00 PM, 6:38:30 PM), 2 Sides 30 (9:22:00 PM, 9:22:30 PM), Groan 30 (3:41:00 PM, 3:41:30 PM), Groan 30 (7:46:00 AM, 7:46:30 AM), "]
["10 Apr 2018","PSA","College Campus Squirrels (5:00:00 PM, 5:00:59 PM), DonT Be A D (1:51:00 PM, 1:51:55 PM), Cellphones At Concerts (12:44:00 AM, 12:45:30 AM), Turn Signals (9:36:00 AM, 9:37:33 AM), Drink Milk (7:50:00 PM, 7:50:55 PM), "]
["10 Apr 2018","Ascertainment","Nature Conservation (7:53:00 AM, 7:56:29 AM), Open Container Law (3:34:00 PM, 3:36:37 PM), Writing Center (11:10:00 AM, 11:11:38 AM), Rolla Parks (9:56:00 PM, 9:58:04 PM), "]
["10 Apr 2018","Ad Council","Click 60 (11:32:00 AM, 11:33:00 AM), Only In The Forest 60 (7:53:00 AM, 7:54:00 AM), Redwoods 30 (6:47:00 PM, 6:47:30 PM), Best In Show Dog 60 (1:36:00 AM, 1:37:00 AM), Groan 30 (9:39:00 PM, 9:39:30 PM), Power Suit 60 (3:32:00 PM, 3:33:00 PM), "]
["11 Apr 2018","PSA","Furnace Filters (12:30:00 AM, 12:31:15 AM), Drink Milk (5:42:00 PM, 5:42:55 PM), Go To Class (1:21:00 PM, 1:22:13 PM), "]
["11 Apr 2018","Ascertainment","Rolla Public Library II (3:37:00 AM, 3:39:15 AM), Stressless Room (3:46:00 PM, 3:47:14 PM), "]
["11 Apr 2018","Ad Council","Pavlov Purpose 60 (3:44:00 PM, 3:45:00 PM), Wed Do Anything 60 (11:45:00 AM, 11:46:00 AM), Airtime 30 (9:59:00 PM, 9:59:30 PM), Rising Ashes-Fire Pit 60 (1:16:00 AM, 1:17:00 AM), "]
["12 Apr 2018","PSA","DonT Text And Drive (1:19:00 PM, 1:20:07 PM), Local Awareness (9:11:00 AM, 9:11:59 AM), Bee Swarm (12:28:00 AM, 12:28:43 AM), Gun Safety (7:38:00 PM, 7:38:43 PM), Cellphones At Concerts (5:13:00 PM, 5:14:30 PM), "]
["12 Apr 2018","Ascertainment","Epistemology (7:07:00 AM, 7:08:11 AM), Lead (9:49:00 PM, 9:49:52 PM), Missouri Caves (3:13:00 PM, 3:14:31 PM), Turn Down Your Ding Dang Speakers (11:45:00 AM, 11:47:15 AM), "]
["12 Apr 2018","Ad Council","Haircut 60 (7:34:00 AM, 7:35:00 AM), Listen 60 (1:23:00 AM, 1:24:00 AM), Tune Out 30 (9:48:00 PM, 9:48:30 PM), Concert 30 (3:14:00 PM, 3:14:30 PM), Pavlov Purpose 30 (11:22:00 AM, 11:22:30 AM), "]
["13 Apr 2018","PSA","Local Awareness (1:16:00 PM, 1:16:59 PM), Black Rhinos (12:49:00 AM, 12:49:48 AM), Cellphones At Concerts (5:49:00 PM, 5:50:30 PM), Piercing Safety (7:31:00 PM, 7:32:37 PM), "]
["13 Apr 2018","Ascertainment","Epistemology (9:49:00 PM, 9:50:11 PM), Electric Car (7:17:00 AM, 7:17:50 AM), Mstreccenter (3:36:00 PM, 3:36:34 PM), DonT Be A Stalker (11:19:00 AM, 11:20:35 AM), Mailbox Decapitation (3:12:00 AM, 3:12:45 AM), "]
["13 Apr 2018","Ad Council","Click 30 (7:40:00 AM, 7:40:30 AM), Rachael Ray 30 (11:43:00 AM, 11:43:30 AM), Redwoods 30 (6:36:00 PM, 6:36:30 PM), Airtime 60 (9:49:00 PM, 9:50:00 PM), Best In Show Dog 60 (1:49:00 AM, 1:50:00 AM), Allison 30 (3:28:00 PM, 3:28:30 PM), "]
["14 Apr 2018","PSA","Local Awareness (5:05:00 PM, 5:05:59 PM), Data Due Diligence (12:03:00 AM, 12:04:51 AM), Underaged Drinking (12:59:00 PM, 1:00:16 PM), "]
["14 Apr 2018","Ascertainment","Epistemology (9:17:00 PM, 9:18:11 PM), Severe Weather Safety Tips (3:34:00 AM, 3:37:11 AM), Rolla Parks (11:22:00 AM, 11:24:04 AM), "]
["14 Apr 2018","Ad Council","Rich Uncle 60 (1:21:00 AM, 1:22:00 AM), Tougher Than Tough 60 (9:16:00 PM, 9:17:00 PM), Click 60 (11:42:00 AM, 11:43:00 AM), "]
["15 Apr 2018","PSA","Pets In Cars (9:41:00 AM, 9:41:34 AM), "]
["15 Apr 2018","Ascertainment","Rolla Animal Shelter I (9:25:00 PM, 9:26:59 PM), Go Outside (3:23:00 PM, 3:24:53 PM), Missouri Caves (11:16:00 AM, 11:17:31 AM), "]
["15 Apr 2018","Ad Council","Lucky 30 (6:54:00 PM, 6:54:30 PM), Smiles 60 (1:31:00 AM, 1:32:00 AM), Short Shorts 60 (9:24:00 PM, 9:25:00 PM), Airtime 60 (3:23:00 PM, 3:24:00 PM), Sense Of Adventure 60 (11:37:00 AM, 11:38:00 AM), "]
["16 Apr 2018","PSA","Local Awareness (12:44:00 AM, 12:44:59 AM), Sleep (7:24:00 PM, 7:25:04 PM), Cellphones At Concerts (5:52:00 PM, 5:53:30 PM), College Campus Squirrels (1:24:00 PM, 1:24:59 PM), Autoerotic Asphyxiation (9:18:00 AM, 9:18:54 AM), "]
["16 Apr 2018","Ascertainment","MST Music (7:13:00 AM, 7:14:23 AM), Stressless Room (3:48:00 PM, 3:49:14 PM), "]
["16 Apr 2018","Ad Council","2 Sides 60 (3:25:00 PM, 3:26:00 PM), Click 60 (6:40:00 PM, 6:41:00 PM), Forest Animals 30 (1:44:00 AM, 1:44:30 AM), Dont Wait-Tornado 30 (7:47:00 AM, 7:47:30 AM), Listen 30 (9:36:00 PM, 9:36:30 PM), Smiles 60 (11:41:00 AM, 11:42:00 AM), "]
["17 Apr 2018","PSA","Handicapped Parking (5:01:00 PM, 5:01:42 PM), Dumpster Diving (7:46:00 PM, 7:49:36 PM), Drink Milk (9:42:00 AM, 9:42:55 AM), Home Mental Illness (1:58:00 PM, 1:58:57 PM), "]
["17 Apr 2018","Ascertainment","University Police (9:40:00 PM, 9:41:09 PM), Electric Car (3:39:00 PM, 3:39:50 PM), Frisbeegolf (11:27:00 AM, 11:27:37 AM), Missouri Caves (7:36:00 AM, 7:37:31 AM), "]
["17 Apr 2018","Ad Council","Click 60 (9:40:00 PM, 9:41:00 PM), Inside The Mind 60 (11:40:00 AM, 11:41:00 AM), I Want To Be 30 (3:39:00 PM, 3:39:30 PM), "]
["18 Apr 2018","PSA","Local Awareness (5:51:00 PM, 5:51:59 PM), Motorcycle Safety I (7:52:00 PM, 7:54:24 PM), Flat Earth (12:28:00 AM, 12:29:20 AM), "]
["18 Apr 2018","Ascertainment","Rolla Leash Laws (3:38:00 AM, 3:40:24 AM), Dags (9:56:00 PM, 9:56:45 PM), Mstreccenter (3:35:00 PM, 3:35:34 PM), Dont Be A Stalker (11:41:00 AM, 11:42:35 AM), "]
["18 Apr 2018","Ad Council","Airtime 60 (10:01:00 PM, 10:02:00 PM), Feather 30 (6:48:00 PM, 6:48:30 PM), Look Down 30 (11:56:00 AM, 11:56:30 AM), 2 Sides 60 (1:26:00 AM, 1:27:00 AM), Pavlov Purpose 60 (3:08:00 PM, 3:09:00 PM), "]
["19 Apr 2018","PSA","Family Mental Illness (7:35:00 PM, 7:35:30 PM), Flat Earth (5:14:00 PM, 5:15:20 PM), Single-Serve Coffee (12:36:00 AM, 12:37:02 AM), Parking etiquette (9:12:00 AM, 9:12:44 AM), "]
["19 Apr 2018","Ascertainment","Senior Companions (3:13:00 PM, 3:14:06 PM), Go Outside (9:00:00 PM, 9:01:53 PM), Dont Be A Stalker (11:23:00 AM, 11:24:35 AM), "]
["19 Apr 2018","Ad Council","Short Shorts 60 (1:37:00 AM, 1:38:00 AM), Sense Of Adventure 30 (11:52:00 AM, 11:52:30 AM), Gift To Future Me 60 (6:44:00 PM, 6:45:00 PM), Forest Animals 30 (3:13:00 PM, 3:13:30 PM), Show And Tell 30 (8:59:00 PM, 8:59:30 PM), "]
["20 Apr 2018","PSA","Water Bottles (7:37:00 PM, 7:40:50 PM), Caffeine Addiction And You (12:49:00 AM, 12:49:56 AM), Cat Herpes (5:47:00 PM, 5:48:12 PM), Campground Etiquette (1:14:00 PM, 1:16:28 PM), "]
{"$rows_left_out":216}